Matter Discount or Credit Category
type: Class
alternative label: 物料折扣或信用类别
subclass of: R8DuEmmnbcptnIZhPdF2Tvx
definition: A Matter Discount or Credit Category is a subcategory of Discounts and Credits that pertains specifically to the reduction of fees or costs associated with a particular legal matter.