New York City Court - Amsterdam
type: Class
subclass of: RCz0OhGJQscjwPvw2jQBP63
definition: New York City Court - Amsterdam is a specific court within the New York City Court system located in Amsterdam, NY.