Equal Pay Act Claim
type: Class
preferred label: Gender Pay Equality Claim
alternative label: Wage Discrimination Claim
subclass of: Rfw7NfMHyrhfFQj8ob4M4U
definition: An Gender Pay Equality Claim is a legal action alleging violation of a law requiring that men and women in the same workplace be given equal pay for equal work. The claim typically involves issues of gender-based wage discrimination.