Insurance Adjuster
type: Class
alternative label: 保险理算师
subclass of: RBl2WJxJ69U7TybdQRUInbs
definition: An insurance adjuster is a professional who works for an insurance company and investigates and evaluates insurance claims made by policyholders.