Inchoate Criminal Offenses
type: Class
alternative label: 未遂犯罪行为
subclass of: R7u1GstOpfAmZ3mI7yFcbgU
definition: Inchoate Criminal Offenses are incomplete or anticipatory criminal acts that have not yet been fully carried out, but are still punishable by law.