Motion to File Oversized Brief
type: Class
alternative label: 提交超大篇幅文件的动议
subclass of: R8ludoWmVMfon7jd8o6ak6E
subclass of: R8xekNn7K6SxToo5ArjIsTX
definition: A Motion to File Oversized Brief is a legal request to submit a brief that exceeds the standard page limit set by the court.