Property Rights and Transactions Law
type: Class
preferred label: Conveyancing
alternative label: 财产权和交易法
subclass of: RBrUb9V2u6f7iVR1RBNsyB1
subclass of: RCIPwpgRpMs1eVz4vPid0pV
subclass of: RDb8aZxNJsmCvQGbfiFyfI7
hidden label: PTRN
definition: Law relating to the acquisition and transfer of real property.