Political Party
type: Class
alternative label: 政党
subclass of: R7oBWHStfmqTLn2MypkW3Pj
definition: A political party is an organized group of individuals who share similar political beliefs and goals, seeking to influence public policy and gain control of government through the electoral process.