Securities Purchase Agreement
type: Class
subclass of: RLxL22W67GcWCpN6VKZd50
definition: Securities Purchase Agreement is a legal contract detailing the sale and purchase of securities, either equity or debt. It includes terms such as the purchase price, representations, warranties, and covenants of the parties involved.