Intranet Management
type: Class
subclass of: R8HLLl44Pya8Fp0uN3ewKRW
definition: Intranet Management refers to the process of organizing and controlling the internal network of an organization, including the management of content, access, and security.