Hit and Run
type: Class
alternative label: हिट एंड रन
subclass of: RCqBiJAwLT5iG2nvk12tNKW
subclass of: Rj1p7FbFSLxlWfUlSPZxhX
definition: The concept of Hit and Run refers to a criminal offense where a person involved in an accident fails to stop and provide information, such as their name and contact details, to the other party involved.