Primary Care Malpractice
type: Class
alternative label: 初级保健医疗事故责任
subclass of: R8nVhrBlasGIc7jxw1D0vbm
definition: Primary Care Malpractice: Negligence or wrongdoing by a healthcare provider who is responsible for the initial diagnosis and treatment of a patient, resulting in harm or injury to the patient.