Welsh
type: Class
alternative label: 威尔士语
subclass of: RDOvAHsvY8TKJ1O1orXPM9o
definition: Welsh (Language) is a structured system of communication that consists of grammar and vocabulary, and is spoken in Wales and some parts of the United Kingdom.