Member Liability in Joint Enterprise
type: Class
alternative label: 联合企业中的成员责任
subclass of: R9JkfZIjkVSa5ud1tJ14w3i
definition: Member Liability in Joint Enterprise refers to the legal responsibility of individuals who are part of a joint enterprise, such as a partnership or corporation, for any liabilities incurred by the enterprise.