DEPRECATED: Bankruptcy Plan Hearing
type: Class
subclass of: R8H8cpx25KBk3kH55YwSdDv
definition: DEPRECATED: Bankruptcy Plan Hearing - A hearing held in a bankruptcy case to consider the confirmation of a plan of reorganization or liquidation.