Association and Membership Liability
type: Class
alternative label: 协会和会员责任
subclass of: R9JkfZIjkVSa5ud1tJ14w3i
definition: Association and Membership Liability refers to the legal responsibility of individuals or entities who are members or associated with a corporation or partnership for any claims or damages arising from the actions or decisions of the organization.