Unmarried
type: Class
alternative label: 未婚的
subclass of: RDgLz1KvQn0YL8W61rW55T4
definition: The concept of "Single (Marital Status)" refers to an individual who is not currently married or in a legally recognized partnership.