Clearly Erroneous
type: Class
alternative label: 明显错误
subclass of: RCpnqQCzeexk3k9kkbLx1Zu
definition: A legal standard of review used by appellate courts to determine if a lower court's decision was clearly incorrect or mistaken.