JD20 Other Settlement Matters (UK J-CODE)
type: Class
subclass of: RDljdV2b9barqaJJzrDUsp4
definition: Work that is directed to settlement including Part 36 and other offers and consequent negotiations (includes all forms of ADR other than mediation).