Breach of Confidential Relationship
type: Class
alternative label: 违反保密关系
subclass of: RJL4HDUmZp1VEEZ7lCwSSF
definition: The Breach of Confidential Relationship is the unauthorized disclosure of confidential information by a person who has a duty to keep it confidential, resulting in harm to the party who entrusted the information.