Schedule of Post-Petition Debts
type: Class
preferred label: Administrative Expense
alternative label: पोस्ट-पेटीशन कर्जों का अनुसूची
subclass of: R9rnaTadzLe6EuX6FHVxEvF
definition: A Schedule of Post-Petition Debts is a list of debts incurred by a debtor after filing for bankruptcy, which must be disclosed to the court and creditors.