Visa for Dependent of Vocational Student
type: Class
alternative label: M-2 Visa
subclass of: RBVXMCXoBW3Ef1c3VUuU84a
definition: The visa for dependents of vocational students (in the U.S., the M-2 visa) is a non-immigrant visa that allows spouses and minor children of vocational students (i.e., M-1 visa holders) to accompany them during their stay in the destination country (e.g., U.S.). In the United States, unlike the M-1 visa holder, M-2 dependents are generally not authorized to work but may engage in full- or part-time study