Project Communication Plan
type: Class
alternative label: 项目沟通计划
subclass of: RC2WMPkRhWUyZLYCJbRJFwj
definition: A plan for communicating status, progress, change management, and other considerations to a project's stakeholders.