ODR - Machine Facilitation
type: Class
subclass of: RRR2i6KF52EMANSCZJce4j
definition: ODR - Machine Facilitation refers to the use of technology to assist in resolving disputes through an online platform, within the context of an Online Dispute Resolution (ODR) Forum.