Novation Clause
type: Class
alternative label: 转让条款
subclass of: RDe0RKU39BlhcyACJW30ZLc
definition: A novation clause is a provision in a contract that allows for the substitution of a new party for one of the original parties, thereby releasing the original party from their obligations and transferring them to the new party.