Tax Disclaimer Clause
type: Class
alternative label: 税务免责声明条款
subclass of: RDe0RKU39BlhcyACJW30ZLc
subclass of: Ram7eqYuiBBxhcC5bDy59J
definition: A Tax Disclaimer Clause is a specific type of contractual clause that disclaims any liability or responsibility for tax-related matters.