Orthopedic Negligence
type: Class
alternative label: 骨科疏忽
subclass of: R7Zbqfhemxs6PR7r2Fk6NeY
definition: Orthopedic Negligence: A type of medical negligence claim that arises when a healthcare provider fails to provide appropriate care for injuries or conditions related to the musculoskeletal system.