Clerk's Notice
type: Class
alternative label: 书记通知
subclass of: RB3FT9lFNQIjRnFIueLgCa7
definition: A Clerk's Notice is a written communication issued by a court clerk, informing parties of a court action or decision.