Intellectual Property Clause
type: Class
alternative label: 知识产权条款
subclass of: RDe0RKU39BlhcyACJW30ZLc
definition: A provision in a contract that outlines the ownership and rights of intangible creations, such as inventions, literary and artistic works, and symbols.