Animal Attack Claim
type: Class
alternative label: 动物攻击索赔
subclass of: R8XMs89zuZc9chn6WQ9Fgbm
subclass of: R8alUnZrt8GVEzHYhh1KTva
definition: A claim for damages resulting from an animal's attack on a person, which falls under the broader categories of animal claims and personal injury claims.