Timber Rights
type: Class
subclass of: RCkPc0XIMxDInzRipCUUZ1q
definition: Timber rights provide the holder with the authority to harvest trees from a designated area of land. These rights can be sold or leased independently of the land itself.