Municipal Law
type: Class
alternative label: 市政法
subclass of: R78xJfSMpJ2ZUUUlYdzfUvC
subclass of: RSYBzf149Mi5KE0YtmpUmr
definition: Municipal Law refers to the body of law that governs the administration of local government and the relationship between municipalities and their residents.