Bailment (Agreement)
type: Class
preferred label: Bailment
alternative label: 保管协议
subclass of: R88D8i8AcSTUig2X3yPbFHg
definition: An agreement in which one party delivers personal property to another party for safekeeping, with the understanding that the property will be returned upon demand or at a specified time.