Financial Elder Abuse
type: Class
alternative label: 金融对老年人的滥用
subclass of: RxwfbvWrxjdHqJhrBu3RWT
definition: The unlawful or unethical exploitation of an elderly person's financial resources, assets, or property by a perpetrator who has a relationship of trust or authority with the victim.