Appellant
type: Class
alternative label: 上诉人
subclass of: RCFgxBbypUKKsDDOJ1iOk36
hidden label: APPL
definition: An appellant is a person, company or entity that applies to a higher court for a reversal of the decision of a lower court.