Internal Use Only Clause
type: Class
alternative label: 仅限内部使用条款
subclass of: RDe0RKU39BlhcyACJW30ZLc
definition: An Internal Use Only Clause is a provision in a contract that restricts the use of certain information or materials to only those within the organization or entity that is a party to the contract.