Superior Offer - Minimum Necessary Amount of Assets
type: Class
alternative label: 优越报价-最少必要资产量
subclass of: R951hKkSGUrKhm07RqJ1hDc
definition: A "Superior Offer - Minimum Necessary Amount of Assets" is a specific threshold within the broader concept of "Superior Offer" that requires a minimum amount of assets to be included in an offer in order for it to be considered superior to other offers in a legal matter.