New York Supreme Court - Oswego County
type: Class
subclass of: R06956a0657387D6513A8528
definition: The New York Supreme Court - Oswego County is a court of general jurisdiction in the state of New York, with authority over civil and criminal cases within Oswego County.