Enterprise Legal Management
type: Class
subclass of: R9QcJpEJ19eAN8glCzxd4Wo
definition: Enterprise Legal Management refers to the process of managing legal operations within a business or organization, including tasks such as legal project management, budgeting, and vendor management.