Appellate Filings - Correspondence and Forms
type: Class
alternative label: 上诉文件 - 通信和表格
subclass of: RDYMGpETSAwljfSaCqHKTND
definition: Appellate Filings - Correspondence and Forms are written or electronic documents submitted to a higher court for review, including letters, requests, certificates, statements, and updates related to a legal case.