Loss of Consortium
type: Class
alternative label: 夫妻感情损失赔偿
subclass of: R8alUnZrt8GVEzHYhh1KTva
subclass of: RBgykmvlnXtCsXRVIBMbLrV
definition: The concept of Loss of Consortium refers to the damages suffered by a spouse or parent due to the injury or death of their loved one, which includes the loss of companionship, affection, and support.