Written Asynchronous Communication
type: Class
alternative label: 书面异步通信
subclass of: R8qItBwG2pRMFhUq1HQEMnb
definition: A communication that occurs in writing and does not require that the users be synchronous (communicating at the same time).