Negligence of Notary Public & Sureties
type: Class
alternative label: 公证人和保证人的疏忽
subclass of: RDp8cEr3KYyVDenm1P9ejdx
definition: The failure of a notary public and their guarantors to exercise reasonable care and diligence in performing their duties, resulting in harm or loss to a party involved in a real estate transaction.