Assamese
type: Class
alternative label: 阿萨姆语
subclass of: RDOvAHsvY8TKJ1O1orXPM9o
definition: Assamese (Language) refers to a structured system of communication that consists of grammar and vocabulary specific to the Assam region of India.