Notice of Assignment
type: Class
alternative label: 转让通知书
subclass of: RB3FT9lFNQIjRnFIueLgCa7
definition: A Notice of Assignment is a written notification that informs a debtor that their debt has been assigned to a third party for collection or other purposes.