Workplace Violence
type: Class
alternative label: 职场暴力
subclass of: RCty0MaQzrLC9KnzjM7nMER
definition: Workplace Violence: Any physical or verbal abuse, harassment, intimidation, or threatening behavior that occurs in a work setting, which may result in harm or injury to employees or damage to property.