Waste
type: Class
alternative label: 废物
subclass of: R8jYAnNATrfoBxAtIKpf72X
subclass of: RCVn9Ew2WyR8O4O5WGDlLKO
subclass of: RDSBerlLWg1ntpLqDQn1eVn
subclass of: RDqSn32zsjxExcBFzIYxT2D
definition: Waste refers to the destruction, damage, or misuse of property by a person who is not the owner, resulting in harm or loss to the owner.