S Corporation
type: Class
alternative label: S公司
subclass of: RDdgYa5ZbqVnS9aGrOwQu5h
definition: An S Corporation is a type of corporation that meets certain Internal Revenue Service requirements and is taxed differently than a regular corporation.