Special Conditions Clause
type: Class
alternative label: 特殊条件条款
subclass of: RDe0RKU39BlhcyACJW30ZLc
definition: A Special Conditions Clause is a provision in a contract that outlines specific terms or requirements that are unique to that particular agreement.