Defense Health Agency
type: Class
alternative label: 国防卫生局
subclass of: RF52f1c417a596A01b36Bcf0
hidden label: DHA
definition: The Defense Health Agency (DHA) is a joint, integrated Combat Support Agency that enables the U.S. Army, U.S. Navy, and U.S. Air Force medical services to provide a medically ready force and ready medical force to Combatant Commands in both peacetime and wartime.